澳门新葡亰网址下载caffe make-mac下安装caffe,make时遇到的问题

by admin on 2020年1月20日

 WheelId CXX0017: Error: symbol “WheelId” not found
 CG.G_澳门新葡亰网址下载 ,zhouZ CXX0017: Error: symbol “CG” not found
 CG1.G_zhouZ CXX0017: Error: symbol “CG1” not found
 gpInParamValue.bUseNewTarget CXX0017: Error: symbol “gpInParamValue”
not found
 gInParamValue.focusRD CXX0017: Error: symbol “gInParamValue” not
found
 gInParamValue.focusL_YD CXX0017: Error: symbol “gInParamValue” not
found

caffe编写翻译现身libgflags.so.2: error adding symbols:
caffe下 make clean后make all后出现

mac下安装caffe,make时遭逢的难点 1C
mac下安装caffe,make时蒙受的难点
CXX/LD -o .build_release/tools/caffe.bin
clang: warning: argument unused during compilation: ‘-pthread’
Undefined symbols for architecture x86_64:
“google::SetUsageMessage(std::__1::basic_string,
std::__1::allocator > const&)”, referenced from:
main in caffe.o
“google::SetVersionString(std::
_1::basic_string,
std::__1::allocator > const&)”, referenced from:
_main in caffe.o
ld: symbol not found for architecture x86_64
clang: error: linker command failed with exit code 1 (use -v to see
invocation)
make: *** [.build_release/tools/caffe.bin] Error 1

…..

CXX/LD -o .build_release/tools/convert_imageset.bin
/usr/bin/ld: .build_release/tools/convert_imageset.o: undefined
reference to symbol
‘_ZN6google14FlagRegistererC1EPKcS2_S2_S2_PvS3_’
//usr/lib/x86_64-linux-gnu/libgflags.so.2: error adding symbols: DSO
missing from command line
collect2: error: ld returned 1 exit status
Makefile:626: recipe for target
‘.build_release/tools/convert_imageset.bin’ failed
make: *** [.build_release/tools/convert_imageset.bin] Error 1

如上,该怎么消除,感激

VC++6.0中冒出如此等等的难点,真汗!求高手支持!极其多谢!

澳门新葡亰网址下载 1

发表评论

电子邮件地址不会被公开。 必填项已用*标注

网站地图xml地图